Обсуждение: Build failed in Jenkins: pgadmin4-master-python37 #146

Поиск
Список
Период
Сортировка

Build failed in Jenkins: pgadmin4-master-python37 #146

От
pgAdmin 4 Jenkins
Дата:
See <https://jenkins.pgadmin.org/job/pgadmin4-master-python37/146/display/redirect?page=changes>

Changes:

[akshay.joshi] Dashboard graph optimization. Fixes #3941

[Dave Page] There are no new features in 4.1 or 4.2, just fixes and optimisations.

[akshay.joshi] Added 'pga4dash' comment for consistency

[Dave Page] Correct error message.

[Dave Page] Exclude HTTPExceptions from the all_exception_handler as they should be

------------------------------------------
[...truncated 1001.65 KB...]
        PgAgentGetTestCase (Get pgAgent job)
        PgAgentPutScheduleTestCase (Update schedule with start and end time,
                    Update schedule with repeat,
                    Update schedule add exception,
                    Update schedule change exception date and time,
                    Update schedule delete exception)
        PgAgentPutStepTestCase (Update step with kind, description, code and error,
                    Update step with connection type and string)
        PgAgentStatsTestCase (Check the stats of pgAgent job)
        TestSSLConnection (Test for SSL connection)
        BackupCreateJobTest (When backup object with default options,
                    When backup object with format directory,
                    When backup the object with option sections to all data,
                    When backup the object with option only_data,
                    When backup the object with option only_schema,
                    When backup the object with option - format plain and dns_owner,
                    When backup the object with option - Do not save privilege, tablespace, unlogged table data,
                    When backup the object with option - Do not save comments,,
                    When backup the object with option - all queries,
                    When backup the object with option - load via partition root,
                    When backup the object with option - all queries and format custom,
                    When backup the object with option - miscellaneous,
                    When backup the object with format tar,
                    When backup the server,
                    When backup the server with option only_data,
                    When backup the server with option only_schema,
                    When backup the server with option - Do not save privilege, tablespace, unlogged table data,
                    When backup the server with option - Do not save comments,,
                    When backup the server with option - all queries,
                    When backup the server with option - miscellaneous,
                    When backup the server with encoding,
                    When backup globals)
        TestUtilityCheckRouteCase (Check utility path route for backup utility,
                    Check utility path route for import export utility,
                    Check utility path route for maintenance utility,
                    Check utility path route for restore utility)
        BackupJobTest (When backup the object with the default options)
        MaintenanceJobTest (When maintenance the object with the default options)
        MaintenanceCreateJobTest (When maintenance object with default options,
                    When maintenance object with VACUUM FULL,
                    When maintenance object with the ANALYZE,
                    When maintenance the object with the REINDEX,
                    When maintenance the object with the CLUSTER)
        RestoreJobTest (When restore the object with the default options)
        RestoreCreateJobTest (When restore object with default options,
                    When restore object with format directory,
                    When restore object with the sections options,
                    When restore the object with Type of objects,
                    When restore object with option - Do not save,
                    When restore object with option - Do not save comments,
                    When restore object with option - Queries,
                    When restore object with option - Disbale,
                    When restore object with option - Miscellaneous)

EDB Postgres AS 9.5:

    433 tests passed
    0 tests failed
    21 tests skipped:
        TableAddTestCase (Create Range partitioned table with 2 partitions,
                    Create List partitioned table with 2 partitions,
                    Create Hash partitioned table with 2 partitions)
        TableUpdateTestCase (Create partitions of existing range partitioned table,
                    Create partitions of existing list partitioned table,
                    Detach partition from existing range partitioned table,
                    Detach partition from existing list partitioned table,
                    Attach partition to existing range partitioned table,
                    Attach partition to existing list partitioned table)
        PgAgentAddTestCase (Add pgAgent job)
        PgAgentDeleteTestCase (Delete pgAgent job)
        PgAgentPutTestCase (Put pgAgent job)
        PgAgentAddScheduleTestCase (Create schedule with exception in pgAgent job)
        PgAgentAddStepTestCase (Create step for pgAgent job)
        PgAgentDeleteScheduleTestCase (Delete pgAgent Schedule)
        PgAgentDeleteStepTestCase (Delete pgAgent Step)
        PgAgentGetTestCase (Get pgAgent job)
        PgAgentPutScheduleTestCase (Update schedule with start and end time,
                    Update schedule with repeat,
                    Update schedule add exception,
                    Update schedule change exception date and time,
                    Update schedule delete exception)
        PgAgentPutStepTestCase (Update step with kind, description, code and error,
                    Update step with connection type and string)
        PgAgentStatsTestCase (Check the stats of pgAgent job)
        TestSSLConnection (Test for SSL connection)
        BackupCreateJobTest (When backup object with default options,
                    When backup object with format directory,
                    When backup the object with option sections to all data,
                    When backup the object with option only_data,
                    When backup the object with option only_schema,
                    When backup the object with option - format plain and dns_owner,
                    When backup the object with option - Do not save privilege, tablespace, unlogged table data,
                    When backup the object with option - Do not save comments,,
                    When backup the object with option - all queries,
                    When backup the object with option - load via partition root,
                    When backup the object with option - all queries and format custom,
                    When backup the object with option - miscellaneous,
                    When backup the object with format tar,
                    When backup the server,
                    When backup the server with option only_data,
                    When backup the server with option only_schema,
                    When backup the server with option - Do not save privilege, tablespace, unlogged table data,
                    When backup the server with option - Do not save comments,,
                    When backup the server with option - all queries,
                    When backup the server with option - miscellaneous,
                    When backup the server with encoding,
                    When backup globals)
        TestUtilityCheckRouteCase (Check utility path route for backup utility,
                    Check utility path route for import export utility,
                    Check utility path route for maintenance utility,
                    Check utility path route for restore utility)
        BackupJobTest (When backup the object with the default options)
        MaintenanceJobTest (When maintenance the object with the default options)
        MaintenanceCreateJobTest (When maintenance object with default options,
                    When maintenance object with VACUUM FULL,
                    When maintenance object with the ANALYZE,
                    When maintenance the object with the REINDEX,
                    When maintenance the object with the CLUSTER)
        RestoreJobTest (When restore the object with the default options)
        RestoreCreateJobTest (When restore object with default options,
                    When restore object with format directory,
                    When restore object with the sections options,
                    When restore the object with Type of objects,
                    When restore object with option - Do not save,
                    When restore object with option - Do not save comments,
                    When restore object with option - Queries,
                    When restore object with option - Disbale,
                    When restore object with option - Miscellaneous)

EDB Postgres AS 9.6:

    433 tests passed
    0 tests failed
    21 tests skipped:
        TableAddTestCase (Create Range partitioned table with 2 partitions,
                    Create List partitioned table with 2 partitions,
                    Create Hash partitioned table with 2 partitions)
        TableUpdateTestCase (Create partitions of existing range partitioned table,
                    Create partitions of existing list partitioned table,
                    Detach partition from existing range partitioned table,
                    Detach partition from existing list partitioned table,
                    Attach partition to existing range partitioned table,
                    Attach partition to existing list partitioned table)
        PgAgentAddTestCase (Add pgAgent job)
        PgAgentDeleteTestCase (Delete pgAgent job)
        PgAgentPutTestCase (Put pgAgent job)
        PgAgentAddScheduleTestCase (Create schedule with exception in pgAgent job)
        PgAgentAddStepTestCase (Create step for pgAgent job)
        PgAgentDeleteScheduleTestCase (Delete pgAgent Schedule)
        PgAgentDeleteStepTestCase (Delete pgAgent Step)
        PgAgentGetTestCase (Get pgAgent job)
        PgAgentPutScheduleTestCase (Update schedule with start and end time,
                    Update schedule with repeat,
                    Update schedule add exception,
                    Update schedule change exception date and time,
                    Update schedule delete exception)
        PgAgentPutStepTestCase (Update step with kind, description, code and error,
                    Update step with connection type and string)
        PgAgentStatsTestCase (Check the stats of pgAgent job)
        TestSSLConnection (Test for SSL connection)
        BackupCreateJobTest (When backup object with default options,
                    When backup object with format directory,
                    When backup the object with option sections to all data,
                    When backup the object with option only_data,
                    When backup the object with option only_schema,
                    When backup the object with option - format plain and dns_owner,
                    When backup the object with option - Do not save privilege, tablespace, unlogged table data,
                    When backup the object with option - Do not save comments,,
                    When backup the object with option - all queries,
                    When backup the object with option - load via partition root,
                    When backup the object with option - all queries and format custom,
                    When backup the object with option - miscellaneous,
                    When backup the object with format tar,
                    When backup the server,
                    When backup the server with option only_data,
                    When backup the server with option only_schema,
                    When backup the server with option - Do not save privilege, tablespace, unlogged table data,
                    When backup the server with option - Do not save comments,,
                    When backup the server with option - all queries,
                    When backup the server with option - miscellaneous,
                    When backup the server with encoding,
                    When backup globals)
        TestUtilityCheckRouteCase (Check utility path route for backup utility,
                    Check utility path route for import export utility,
                    Check utility path route for maintenance utility,
                    Check utility path route for restore utility)
        BackupJobTest (When backup the object with the default options)
        MaintenanceJobTest (When maintenance the object with the default options)
        MaintenanceCreateJobTest (When maintenance object with default options,
                    When maintenance object with VACUUM FULL,
                    When maintenance object with the ANALYZE,
                    When maintenance the object with the REINDEX,
                    When maintenance the object with the CLUSTER)
        RestoreJobTest (When restore the object with the default options)
        RestoreCreateJobTest (When restore object with default options,
                    When restore object with format directory,
                    When restore object with the sections options,
                    When restore the object with Type of objects,
                    When restore object with option - Do not save,
                    When restore object with option - Do not save comments,
                    When restore object with option - Queries,
                    When restore object with option - Disbale,
                    When restore object with option - Miscellaneous)
NOTE: Configuring authentication for DESKTOP mode.
pgAdmin 4 - Application Initialisation
======================================

Executing and polling with: 2 NOTICES WITH DATASET
Executing and polling with: 1000 NOTICES WITH DATASET
Executing and polling with: NO NOTICE WITH DATASET
Executing and polling with: 2 NOTICES WITH DATASET
Executing and polling with: 1000 NOTICES WITH DATASET
Executing and polling with: NO NOTICE WITH DATASET
Executing and polling with: 2 NOTICES WITH DATASET
Executing and polling with: 1000 NOTICES WITH DATASET
Executing and polling with: NO NOTICE WITH DATASET
Executing and polling with: 2 NOTICES WITH DATASET
Executing and polling with: 1000 NOTICES WITH DATASET
Executing and polling with: NO NOTICE WITH DATASET
Executing and polling with: 2 NOTICES WITH DATASET
Executing and polling with: 1000 NOTICES WITH DATASET
Executing and polling with: NO NOTICE WITH DATASET
Executing and polling with: 2 NOTICES WITH DATASET
Executing and polling with: 1000 NOTICES WITH DATASET
Executing and polling with: NO NOTICE WITH DATASET
Executing and polling with: 2 NOTICES WITH DATASET
Executing and polling with: 1000 NOTICES WITH DATASET
Executing and polling with: NO NOTICE WITH DATASET
Executing and polling with: 2 NOTICES WITH DATASET
Executing and polling with: 1000 NOTICES WITH DATASET
Executing and polling with: NO NOTICE WITH DATASET
Executing and polling with: 2 NOTICES WITH DATASET
Executing and polling with: 1000 NOTICES WITH DATASET
Executing and polling with: NO NOTICE WITH DATASET
Executing and polling with: 2 NOTICES WITH DATASET
Executing and polling with: 1000 NOTICES WITH DATASET
Executing and polling with: NO NOTICE WITH DATASET
Executing and polling with: 2 NOTICES WITH DATASET
Executing and polling with: 1000 NOTICES WITH DATASET
Executing and polling with: NO NOTICE WITH DATASET
Please check output in file:
<https://jenkins.pgadmin.org/job/pgadmin4-master-python37/ws/web/regression/regression.log>


======================================================================

ERROR: Error detected when running the Python tests.
ERROR: Error detected when running the Python tests.
Build step 'Execute shell' marked build as failure
Not sending mail to unregistered user akshay.joshi@enterprisedb.com


Build failed in Jenkins: pgadmin4-master-python37 #147

От
pgAdmin 4 Jenkins
Дата:
See <https://jenkins.pgadmin.org/job/pgadmin4-master-python37/147/display/redirect?page=changes>

Changes:

[akshay.joshi] Fixed API test case for dashboard graphs.

------------------------------------------
[...truncated 1.00 MB...]
HeadlessChrome 0.0.0 (Linux 0.0.0): Executed 530 of 773 (1 FAILED) (0 secs / 9.282 secs)
HeadlessChrome 0.0.0 (Linux 0.0.0): Executed 531 of 773 (1 FAILED) (0 secs / 9.285 secs)
HeadlessChrome 0.0.0 (Linux 0.0.0): Executed 532 of 773 (1 FAILED) (0 secs / 9.287 secs)
HeadlessChrome 0.0.0 (Linux 0.0.0): Executed 533 of 773 (1 FAILED) (0 secs / 9.295 secs)
HeadlessChrome 0.0.0 (Linux 0.0.0): Executed 534 of 773 (1 FAILED) (0 secs / 9.301 secs)
HeadlessChrome 0.0.0 (Linux 0.0.0): Executed 535 of 773 (1 FAILED) (0 secs / 9.304 secs)
HeadlessChrome 0.0.0 (Linux 0.0.0): Executed 536 of 773 (1 FAILED) (0 secs / 9.311 secs)
HeadlessChrome 0.0.0 (Linux 0.0.0): Executed 537 of 773 (1 FAILED) (0 secs / 9.315 secs)
HeadlessChrome 0.0.0 (Linux 0.0.0): Executed 538 of 773 (1 FAILED) (0 secs / 9.319 secs)
HeadlessChrome 0.0.0 (Linux 0.0.0): Executed 539 of 773 (1 FAILED) (0 secs / 9.321 secs)
HeadlessChrome 0.0.0 (Linux 0.0.0): Executed 540 of 773 (1 FAILED) (0 secs / 9.325 secs)
HeadlessChrome 0.0.0 (Linux 0.0.0): Executed 541 of 773 (1 FAILED) (0 secs / 9.359 secs)
HeadlessChrome 0.0.0 (Linux 0.0.0): Executed 542 of 773 (1 FAILED) (0 secs / 9.364 secs)
HeadlessChrome 0.0.0 (Linux 0.0.0): Executed 543 of 773 (1 FAILED) (0 secs / 9.367 secs)
HeadlessChrome 0.0.0 (Linux 0.0.0): Executed 544 of 773 (1 FAILED) (0 secs / 9.371 secs)
HeadlessChrome 0.0.0 (Linux 0.0.0): Executed 545 of 773 (1 FAILED) (0 secs / 9.381 secs)
HeadlessChrome 0.0.0 (Linux 0.0.0): Executed 546 of 773 (1 FAILED) (0 secs / 9.384 secs)
HeadlessChrome 0.0.0 (Linux 0.0.0): Executed 547 of 773 (1 FAILED) (0 secs / 9.391 secs)
HeadlessChrome 0.0.0 (Linux 0.0.0): Executed 548 of 773 (1 FAILED) (0 secs / 9.398 secs)
HeadlessChrome 0.0.0 (Linux 0.0.0): Executed 549 of 773 (1 FAILED) (0 secs / 9.402 secs)
HeadlessChrome 0.0.0 (Linux 0.0.0): Executed 550 of 773 (1 FAILED) (0 secs / 9.407 secs)
HeadlessChrome 0.0.0 (Linux 0.0.0): Executed 551 of 773 (1 FAILED) (0 secs / 9.411 secs)
HeadlessChrome 0.0.0 (Linux 0.0.0): Executed 552 of 773 (1 FAILED) (0 secs / 9.415 secs)
HeadlessChrome 0.0.0 (Linux 0.0.0): Executed 553 of 773 (1 FAILED) (0 secs / 9.419 secs)
HeadlessChrome 0.0.0 (Linux 0.0.0): Executed 554 of 773 (1 FAILED) (0 secs / 9.424 secs)
HeadlessChrome 0.0.0 (Linux 0.0.0): Executed 555 of 773 (1 FAILED) (0 secs / 9.428 secs)
HeadlessChrome 0.0.0 (Linux 0.0.0): Executed 556 of 773 (1 FAILED) (0 secs / 9.432 secs)
HeadlessChrome 0.0.0 (Linux 0.0.0): Executed 557 of 773 (1 FAILED) (0 secs / 9.435 secs)
HeadlessChrome 0.0.0 (Linux 0.0.0): Executed 558 of 773 (1 FAILED) (0 secs / 9.441 secs)
HeadlessChrome 0.0.0 (Linux 0.0.0): Executed 559 of 773 (1 FAILED) (0 secs / 9.444 secs)
HeadlessChrome 0.0.0 (Linux 0.0.0): Executed 560 of 773 (1 FAILED) (0 secs / 9.447 secs)
HeadlessChrome 0.0.0 (Linux 0.0.0): Executed 561 of 773 (1 FAILED) (0 secs / 9.451 secs)
HeadlessChrome 0.0.0 (Linux 0.0.0): Executed 562 of 773 (1 FAILED) (0 secs / 9.456 secs)
HeadlessChrome 0.0.0 (Linux 0.0.0): Executed 563 of 773 (1 FAILED) (0 secs / 9.46 secs)
HeadlessChrome 0.0.0 (Linux 0.0.0): Executed 564 of 773 (1 FAILED) (0 secs / 9.464 secs)
HeadlessChrome 0.0.0 (Linux 0.0.0): Executed 565 of 773 (1 FAILED) (0 secs / 9.467 secs)
HeadlessChrome 0.0.0 (Linux 0.0.0): Executed 566 of 773 (1 FAILED) (0 secs / 9.471 secs)
HeadlessChrome 0.0.0 (Linux 0.0.0): Executed 567 of 773 (1 FAILED) (0 secs / 9.473 secs)
HeadlessChrome 0.0.0 (Linux 0.0.0): Executed 568 of 773 (1 FAILED) (0 secs / 9.476 secs)
HeadlessChrome 0.0.0 (Linux 0.0.0): Executed 569 of 773 (1 FAILED) (0 secs / 9.48 secs)
HeadlessChrome 0.0.0 (Linux 0.0.0): Executed 570 of 773 (1 FAILED) (0 secs / 9.486 secs)
HeadlessChrome 0.0.0 (Linux 0.0.0): Executed 571 of 773 (1 FAILED) (0 secs / 9.493 secs)
HeadlessChrome 0.0.0 (Linux 0.0.0): Executed 572 of 773 (1 FAILED) (0 secs / 9.495 secs)
HeadlessChrome 0.0.0 (Linux 0.0.0): Executed 573 of 773 (1 FAILED) (0 secs / 9.497 secs)
HeadlessChrome 0.0.0 (Linux 0.0.0): Executed 574 of 773 (1 FAILED) (0 secs / 9.504 secs)
HeadlessChrome 0.0.0 (Linux 0.0.0): Executed 575 of 773 (1 FAILED) (0 secs / 9.507 secs)
HeadlessChrome 0.0.0 (Linux 0.0.0): Executed 576 of 773 (1 FAILED) (0 secs / 9.511 secs)
HeadlessChrome 0.0.0 (Linux 0.0.0): Executed 577 of 773 (1 FAILED) (0 secs / 9.516 secs)
HeadlessChrome 0.0.0 (Linux 0.0.0): Executed 578 of 773 (1 FAILED) (0 secs / 9.518 secs)
HeadlessChrome 0.0.0 (Linux 0.0.0): Executed 579 of 773 (1 FAILED) (0 secs / 9.521 secs)
HeadlessChrome 0.0.0 (Linux 0.0.0): Executed 580 of 773 (1 FAILED) (0 secs / 9.523 secs)
HeadlessChrome 0.0.0 (Linux 0.0.0): Executed 581 of 773 (1 FAILED) (0 secs / 9.532 secs)
HeadlessChrome 0.0.0 (Linux 0.0.0): Executed 582 of 773 (1 FAILED) (0 secs / 9.535 secs)
HeadlessChrome 0.0.0 (Linux 0.0.0): Executed 583 of 773 (1 FAILED) (0 secs / 9.538 secs)
HeadlessChrome 0.0.0 (Linux 0.0.0): Executed 584 of 773 (1 FAILED) (0 secs / 9.542 secs)
HeadlessChrome 0.0.0 (Linux 0.0.0): Executed 585 of 773 (1 FAILED) (0 secs / 9.548 secs)
HeadlessChrome 0.0.0 (Linux 0.0.0): Executed 586 of 773 (1 FAILED) (0 secs / 9.551 secs)
HeadlessChrome 0.0.0 (Linux 0.0.0): Executed 587 of 773 (1 FAILED) (0 secs / 9.554 secs)
HeadlessChrome 0.0.0 (Linux 0.0.0): Executed 588 of 773 (1 FAILED) (0 secs / 9.557 secs)
HeadlessChrome 0.0.0 (Linux 0.0.0): Executed 589 of 773 (1 FAILED) (0 secs / 9.56 secs)
HeadlessChrome 0.0.0 (Linux 0.0.0): Executed 590 of 773 (1 FAILED) (0 secs / 9.562 secs)
HeadlessChrome 0.0.0 (Linux 0.0.0): Executed 591 of 773 (1 FAILED) (0 secs / 9.564 secs)
HeadlessChrome 0.0.0 (Linux 0.0.0): Executed 592 of 773 (1 FAILED) (0 secs / 9.566 secs)
HeadlessChrome 0.0.0 (Linux 0.0.0): Executed 593 of 773 (1 FAILED) (0 secs / 9.568 secs)
HeadlessChrome 0.0.0 (Linux 0.0.0): Executed 594 of 773 (1 FAILED) (0 secs / 9.572 secs)
HeadlessChrome 0.0.0 (Linux 0.0.0): Executed 595 of 773 (1 FAILED) (0 secs / 9.575 secs)
HeadlessChrome 0.0.0 (Linux 0.0.0): Executed 596 of 773 (1 FAILED) (0 secs / 9.577 secs)
HeadlessChrome 0.0.0 (Linux 0.0.0): Executed 597 of 773 (1 FAILED) (0 secs / 9.579 secs)
HeadlessChrome 0.0.0 (Linux 0.0.0): Executed 598 of 773 (1 FAILED) (0 secs / 9.58 secs)
HeadlessChrome 0.0.0 (Linux 0.0.0): Executed 599 of 773 (1 FAILED) (0 secs / 9.582 secs)
HeadlessChrome 0.0.0 (Linux 0.0.0): Executed 600 of 773 (1 FAILED) (0 secs / 9.584 secs)
HeadlessChrome 0.0.0 (Linux 0.0.0): Executed 601 of 773 (1 FAILED) (0 secs / 9.587 secs)
HeadlessChrome 0.0.0 (Linux 0.0.0): Executed 602 of 773 (1 FAILED) (0 secs / 9.591 secs)
HeadlessChrome 0.0.0 (Linux 0.0.0): Executed 603 of 773 (1 FAILED) (0 secs / 9.593 secs)
HeadlessChrome 0.0.0 (Linux 0.0.0): Executed 604 of 773 (1 FAILED) (0 secs / 9.595 secs)
HeadlessChrome 0.0.0 (Linux 0.0.0): Executed 605 of 773 (1 FAILED) (0 secs / 9.596 secs)
HeadlessChrome 0.0.0 (Linux 0.0.0): Executed 606 of 773 (1 FAILED) (0 secs / 9.598 secs)
HeadlessChrome 0.0.0 (Linux 0.0.0): Executed 607 of 773 (1 FAILED) (0 secs / 9.6 secs)
HeadlessChrome 0.0.0 (Linux 0.0.0): Executed 608 of 773 (1 FAILED) (0 secs / 9.602 secs)
HeadlessChrome 0.0.0 (Linux 0.0.0): Executed 609 of 773 (1 FAILED) (0 secs / 9.604 secs)
HeadlessChrome 0.0.0 (Linux 0.0.0): Executed 610 of 773 (1 FAILED) (0 secs / 9.605 secs)
HeadlessChrome 0.0.0 (Linux 0.0.0): Executed 611 of 773 (1 FAILED) (0 secs / 9.607 secs)
HeadlessChrome 0.0.0 (Linux 0.0.0): Executed 612 of 773 (1 FAILED) (0 secs / 9.608 secs)
HeadlessChrome 0.0.0 (Linux 0.0.0): Executed 613 of 773 (1 FAILED) (0 secs / 9.61 secs)
HeadlessChrome 0.0.0 (Linux 0.0.0): Executed 614 of 773 (1 FAILED) (0 secs / 9.612 secs)
HeadlessChrome 0.0.0 (Linux 0.0.0): Executed 615 of 773 (1 FAILED) (0 secs / 9.614 secs)
HeadlessChrome 0.0.0 (Linux 0.0.0): Executed 616 of 773 (1 FAILED) (0 secs / 9.617 secs)
HeadlessChrome 0.0.0 (Linux 0.0.0): Executed 617 of 773 (1 FAILED) (0 secs / 9.62 secs)
HeadlessChrome 0.0.0 (Linux 0.0.0): Executed 618 of 773 (1 FAILED) (0 secs / 9.623 secs)
HeadlessChrome 0.0.0 (Linux 0.0.0): Executed 619 of 773 (1 FAILED) (0 secs / 9.626 secs)
HeadlessChrome 0.0.0 (Linux 0.0.0): Executed 620 of 773 (1 FAILED) (0 secs / 9.628 secs)
HeadlessChrome 0.0.0 (Linux 0.0.0): Executed 621 of 773 (1 FAILED) (0 secs / 9.629 secs)
HeadlessChrome 0.0.0 (Linux 0.0.0): Executed 622 of 773 (1 FAILED) (0 secs / 9.631 secs)
HeadlessChrome 0.0.0 (Linux 0.0.0): Executed 623 of 773 (1 FAILED) (0 secs / 9.635 secs)
HeadlessChrome 0.0.0 (Linux 0.0.0): Executed 624 of 773 (1 FAILED) (0 secs / 9.644 secs)
HeadlessChrome 0.0.0 (Linux 0.0.0): Executed 625 of 773 (1 FAILED) (0 secs / 9.645 secs)
HeadlessChrome 0.0.0 (Linux 0.0.0): Executed 626 of 773 (1 FAILED) (0 secs / 9.647 secs)
HeadlessChrome 0.0.0 (Linux 0.0.0): Executed 627 of 773 (1 FAILED) (0 secs / 9.648 secs)
HeadlessChrome 0.0.0 (Linux 0.0.0): Executed 628 of 773 (1 FAILED) (0 secs / 9.65 secs)
HeadlessChrome 0.0.0 (Linux 0.0.0): Executed 629 of 773 (1 FAILED) (0 secs / 9.65 secs)
HeadlessChrome 0.0.0 (Linux 0.0.0): Executed 630 of 773 (1 FAILED) (0 secs / 9.653 secs)
HeadlessChrome 0.0.0 (Linux 0.0.0): Executed 631 of 773 (1 FAILED) (0 secs / 9.654 secs)
HeadlessChrome 0.0.0 (Linux 0.0.0): Executed 632 of 773 (1 FAILED) (0 secs / 9.656 secs)
HeadlessChrome 0.0.0 (Linux 0.0.0): Executed 633 of 773 (1 FAILED) (0 secs / 9.659 secs)
HeadlessChrome 0.0.0 (Linux 0.0.0): Executed 634 of 773 (1 FAILED) (0 secs / 9.667 secs)
HeadlessChrome 0.0.0 (Linux 0.0.0): Executed 635 of 773 (1 FAILED) (0 secs / 9.668 secs)
HeadlessChrome 0.0.0 (Linux 0.0.0): Executed 636 of 773 (1 FAILED) (0 secs / 9.67 secs)
HeadlessChrome 0.0.0 (Linux 0.0.0): Executed 637 of 773 (1 FAILED) (0 secs / 9.671 secs)
HeadlessChrome 0.0.0 (Linux 0.0.0): Executed 638 of 773 (1 FAILED) (0 secs / 9.673 secs)
HeadlessChrome 0.0.0 (Linux 0.0.0): Executed 639 of 773 (1 FAILED) (0 secs / 9.674 secs)
HeadlessChrome 0.0.0 (Linux 0.0.0): Executed 640 of 773 (1 FAILED) (0 secs / 9.678 secs)
HeadlessChrome 0.0.0 (Linux 0.0.0): Executed 641 of 773 (1 FAILED) (0 secs / 9.68 secs)
HeadlessChrome 0.0.0 (Linux 0.0.0): Executed 642 of 773 (1 FAILED) (0 secs / 9.682 secs)
HeadlessChrome 0.0.0 (Linux 0.0.0): Executed 643 of 773 (1 FAILED) (0 secs / 9.684 secs)
HeadlessChrome 0.0.0 (Linux 0.0.0): Executed 644 of 773 (1 FAILED) (0 secs / 9.688 secs)
HeadlessChrome 0.0.0 (Linux 0.0.0): Executed 645 of 773 (1 FAILED) (0 secs / 9.69 secs)
HeadlessChrome 0.0.0 (Linux 0.0.0): Executed 646 of 773 (1 FAILED) (0 secs / 9.693 secs)
HeadlessChrome 0.0.0 (Linux 0.0.0): Executed 647 of 773 (1 FAILED) (0 secs / 9.695 secs)
HeadlessChrome 0.0.0 (Linux 0.0.0): Executed 648 of 773 (1 FAILED) (0 secs / 9.698 secs)
HeadlessChrome 0.0.0 (Linux 0.0.0): Executed 649 of 773 (1 FAILED) (0 secs / 9.699 secs)
HeadlessChrome 0.0.0 (Linux 0.0.0): Executed 650 of 773 (1 FAILED) (0 secs / 9.7 secs)
HeadlessChrome 0.0.0 (Linux 0.0.0): Executed 651 of 773 (1 FAILED) (0 secs / 9.702 secs)
HeadlessChrome 0.0.0 (Linux 0.0.0): Executed 652 of 773 (1 FAILED) (0 secs / 9.706 secs)
HeadlessChrome 0.0.0 (Linux 0.0.0): Executed 653 of 773 (1 FAILED) (0 secs / 9.707 secs)
HeadlessChrome 0.0.0 (Linux 0.0.0): Executed 654 of 773 (1 FAILED) (0 secs / 9.709 secs)
HeadlessChrome 0.0.0 (Linux 0.0.0): Executed 655 of 773 (1 FAILED) (0 secs / 9.711 secs)
HeadlessChrome 0.0.0 (Linux 0.0.0): Executed 656 of 773 (1 FAILED) (0 secs / 9.714 secs)
HeadlessChrome 0.0.0 (Linux 0.0.0): Executed 657 of 773 (1 FAILED) (0 secs / 9.715 secs)
HeadlessChrome 0.0.0 (Linux 0.0.0): Executed 658 of 773 (1 FAILED) (0 secs / 9.717 secs)
HeadlessChrome 0.0.0 (Linux 0.0.0): Executed 659 of 773 (1 FAILED) (0 secs / 9.722 secs)
HeadlessChrome 0.0.0 (Linux 0.0.0): Executed 660 of 773 (1 FAILED) (0 secs / 9.723 secs)
HeadlessChrome 0.0.0 (Linux 0.0.0): Executed 661 of 773 (1 FAILED) (0 secs / 9.725 secs)
HeadlessChrome 0.0.0 (Linux 0.0.0): Executed 662 of 773 (1 FAILED) (0 secs / 9.726 secs)
HeadlessChrome 0.0.0 (Linux 0.0.0): Executed 663 of 773 (1 FAILED) (0 secs / 9.727 secs)
HeadlessChrome 0.0.0 (Linux 0.0.0): Executed 664 of 773 (1 FAILED) (0 secs / 9.728 secs)
HeadlessChrome 0.0.0 (Linux 0.0.0): Executed 665 of 773 (1 FAILED) (0 secs / 9.732 secs)
HeadlessChrome 0.0.0 (Linux 0.0.0): Executed 666 of 773 (1 FAILED) (0 secs / 9.734 secs)
HeadlessChrome 0.0.0 (Linux 0.0.0): Executed 667 of 773 (1 FAILED) (0 secs / 9.735 secs)
HeadlessChrome 0.0.0 (Linux 0.0.0): Executed 668 of 773 (1 FAILED) (0 secs / 9.737 secs)
HeadlessChrome 0.0.0 (Linux 0.0.0): Executed 669 of 773 (1 FAILED) (0 secs / 9.738 secs)
HeadlessChrome 0.0.0 (Linux 0.0.0): Executed 670 of 773 (1 FAILED) (0 secs / 9.74 secs)
HeadlessChrome 0.0.0 (Linux 0.0.0): Executed 671 of 773 (1 FAILED) (0 secs / 9.742 secs)
HeadlessChrome 0.0.0 (Linux 0.0.0): Executed 672 of 773 (1 FAILED) (0 secs / 9.743 secs)
HeadlessChrome 0.0.0 (Linux 0.0.0): Executed 673 of 773 (1 FAILED) (0 secs / 9.747 secs)
HeadlessChrome 0.0.0 (Linux 0.0.0): Executed 674 of 773 (1 FAILED) (0 secs / 9.749 secs)
HeadlessChrome 0.0.0 (Linux 0.0.0): Executed 675 of 773 (1 FAILED) (0 secs / 9.752 secs)
HeadlessChrome 0.0.0 (Linux 0.0.0): Executed 676 of 773 (1 FAILED) (0 secs / 9.754 secs)
HeadlessChrome 0.0.0 (Linux 0.0.0): Executed 677 of 773 (1 FAILED) (0 secs / 9.755 secs)
HeadlessChrome 0.0.0 (Linux 0.0.0): Executed 678 of 773 (1 FAILED) (0 secs / 9.757 secs)
HeadlessChrome 0.0.0 (Linux 0.0.0): Executed 679 of 773 (1 FAILED) (0 secs / 9.759 secs)
HeadlessChrome 0.0.0 (Linux 0.0.0): Executed 680 of 773 (1 FAILED) (0 secs / 9.763 secs)
HeadlessChrome 0.0.0 (Linux 0.0.0): Executed 681 of 773 (1 FAILED) (0 secs / 9.765 secs)
HeadlessChrome 0.0.0 (Linux 0.0.0): Executed 682 of 773 (1 FAILED) (0 secs / 9.767 secs)
HeadlessChrome 0.0.0 (Linux 0.0.0): Executed 683 of 773 (1 FAILED) (0 secs / 9.769 secs)
HeadlessChrome 0.0.0 (Linux 0.0.0): Executed 684 of 773 (1 FAILED) (0 secs / 9.771 secs)
HeadlessChrome 0.0.0 (Linux 0.0.0): Executed 685 of 773 (1 FAILED) (0 secs / 9.772 secs)
HeadlessChrome 0.0.0 (Linux 0.0.0): Executed 686 of 773 (1 FAILED) (0 secs / 9.773 secs)
HeadlessChrome 0.0.0 (Linux 0.0.0): Executed 687 of 773 (1 FAILED) (0 secs / 9.78 secs)
HeadlessChrome 0.0.0 (Linux 0.0.0): Executed 688 of 773 (1 FAILED) (0 secs / 9.781 secs)
HeadlessChrome 0.0.0 (Linux 0.0.0): Executed 689 of 773 (1 FAILED) (0 secs / 9.785 secs)
HeadlessChrome 0.0.0 (Linux 0.0.0): Executed 690 of 773 (1 FAILED) (0 secs / 9.807 secs)
HeadlessChrome 0.0.0 (Linux 0.0.0): Executed 691 of 773 (1 FAILED) (0 secs / 9.812 secs)
HeadlessChrome 0.0.0 (Linux 0.0.0): Executed 692 of 773 (1 FAILED) (0 secs / 9.815 secs)
HeadlessChrome 0.0.0 (Linux 0.0.0): Executed 693 of 773 (1 FAILED) (0 secs / 9.836 secs)
HeadlessChrome 0.0.0 (Linux 0.0.0): Executed 694 of 773 (1 FAILED) (0 secs / 9.841 secs)
HeadlessChrome 0.0.0 (Linux 0.0.0): Executed 695 of 773 (1 FAILED) (0 secs / 9.842 secs)
HeadlessChrome 0.0.0 (Linux 0.0.0): Executed 696 of 773 (1 FAILED) (0 secs / 9.844 secs)
HeadlessChrome 0.0.0 (Linux 0.0.0): Executed 697 of 773 (1 FAILED) (0 secs / 9.866 secs)
HeadlessChrome 0.0.0 (Linux 0.0.0): Executed 698 of 773 (1 FAILED) (0 secs / 9.872 secs)
HeadlessChrome 0.0.0 (Linux 0.0.0): Executed 699 of 773 (1 FAILED) (0 secs / 9.875 secs)
HeadlessChrome 0.0.0 (Linux 0.0.0): Executed 700 of 773 (1 FAILED) (0 secs / 9.897 secs)
HeadlessChrome 0.0.0 (Linux 0.0.0): Executed 701 of 773 (1 FAILED) (0 secs / 9.899 secs)
HeadlessChrome 0.0.0 (Linux 0.0.0): Executed 702 of 773 (1 FAILED) (0 secs / 9.903 secs)
HeadlessChrome 0.0.0 (Linux 0.0.0): Executed 703 of 773 (1 FAILED) (0 secs / 9.904 secs)
HeadlessChrome 0.0.0 (Linux 0.0.0): Executed 704 of 773 (1 FAILED) (0 secs / 9.906 secs)
HeadlessChrome 0.0.0 (Linux 0.0.0): Executed 705 of 773 (1 FAILED) (0 secs / 9.908 secs)
HeadlessChrome 0.0.0 (Linux 0.0.0): Executed 706 of 773 (1 FAILED) (0 secs / 9.909 secs)
HeadlessChrome 0.0.0 (Linux 0.0.0): Executed 707 of 773 (1 FAILED) (0 secs / 9.911 secs)
HeadlessChrome 0.0.0 (Linux 0.0.0): Executed 708 of 773 (1 FAILED) (0 secs / 9.913 secs)
HeadlessChrome 0.0.0 (Linux 0.0.0): Executed 709 of 773 (1 FAILED) (0 secs / 9.916 secs)
HeadlessChrome 0.0.0 (Linux 0.0.0): Executed 710 of 773 (1 FAILED) (0 secs / 9.918 secs)
HeadlessChrome 0.0.0 (Linux 0.0.0): Executed 711 of 773 (1 FAILED) (0 secs / 9.919 secs)
HeadlessChrome 0.0.0 (Linux 0.0.0): Executed 712 of 773 (1 FAILED) (0 secs / 9.92 secs)
HeadlessChrome 0.0.0 (Linux 0.0.0): Executed 713 of 773 (1 FAILED) (0 secs / 9.922 secs)
HeadlessChrome 0.0.0 (Linux 0.0.0): Executed 714 of 773 (1 FAILED) (0 secs / 9.924 secs)
HeadlessChrome 0.0.0 (Linux 0.0.0): Executed 715 of 773 (1 FAILED) (0 secs / 9.928 secs)
HeadlessChrome 0.0.0 (Linux 0.0.0): Executed 716 of 773 (1 FAILED) (0 secs / 9.929 secs)
HeadlessChrome 0.0.0 (Linux 0.0.0): Executed 717 of 773 (1 FAILED) (0 secs / 9.931 secs)
HeadlessChrome 0.0.0 (Linux 0.0.0): Executed 718 of 773 (1 FAILED) (0 secs / 9.933 secs)
HeadlessChrome 0.0.0 (Linux 0.0.0): Executed 719 of 773 (1 FAILED) (0 secs / 9.934 secs)
HeadlessChrome 0.0.0 (Linux 0.0.0): Executed 720 of 773 (1 FAILED) (0 secs / 9.937 secs)
HeadlessChrome 0.0.0 (Linux 0.0.0): Executed 721 of 773 (1 FAILED) (0 secs / 9.941 secs)
HeadlessChrome 0.0.0 (Linux 0.0.0): Executed 722 of 773 (1 FAILED) (0 secs / 9.944 secs)
HeadlessChrome 0.0.0 (Linux 0.0.0): Executed 723 of 773 (1 FAILED) (0 secs / 9.946 secs)
HeadlessChrome 0.0.0 (Linux 0.0.0): Executed 724 of 773 (1 FAILED) (0 secs / 9.968 secs)
HeadlessChrome 0.0.0 (Linux 0.0.0): Executed 725 of 773 (1 FAILED) (0 secs / 9.971 secs)
HeadlessChrome 0.0.0 (Linux 0.0.0): Executed 726 of 773 (1 FAILED) (0 secs / 9.993 secs)
HeadlessChrome 0.0.0 (Linux 0.0.0): Executed 727 of 773 (1 FAILED) (0 secs / 9.994 secs)
HeadlessChrome 0.0.0 (Linux 0.0.0): Executed 728 of 773 (1 FAILED) (0 secs / 9.996 secs)
HeadlessChrome 0.0.0 (Linux 0.0.0): Executed 729 of 773 (1 FAILED) (0 secs / 9.998 secs)
HeadlessChrome 0.0.0 (Linux 0.0.0): Executed 730 of 773 (1 FAILED) (0 secs / 10 secs)
HeadlessChrome 0.0.0 (Linux 0.0.0): Executed 731 of 773 (1 FAILED) (0 secs / 10.001 secs)
HeadlessChrome 0.0.0 (Linux 0.0.0): Executed 732 of 773 (1 FAILED) (0 secs / 10.006 secs)
HeadlessChrome 0.0.0 (Linux 0.0.0): Executed 733 of 773 (1 FAILED) (0 secs / 10.007 secs)
HeadlessChrome 0.0.0 (Linux 0.0.0): Executed 734 of 773 (1 FAILED) (0 secs / 10.009 secs)
HeadlessChrome 0.0.0 (Linux 0.0.0): Executed 735 of 773 (1 FAILED) (0 secs / 10.011 secs)
HeadlessChrome 0.0.0 (Linux 0.0.0): Executed 736 of 773 (1 FAILED) (0 secs / 10.013 secs)
HeadlessChrome 0.0.0 (Linux 0.0.0): Executed 737 of 773 (1 FAILED) (0 secs / 10.014 secs)
HeadlessChrome 0.0.0 (Linux 0.0.0): Executed 738 of 773 (1 FAILED) (0 secs / 10.016 secs)
HeadlessChrome 0.0.0 (Linux 0.0.0): Executed 739 of 773 (1 FAILED) (0 secs / 10.02 secs)
HeadlessChrome 0.0.0 (Linux 0.0.0): Executed 740 of 773 (1 FAILED) (0 secs / 10.023 secs)
HeadlessChrome 0.0.0 (Linux 0.0.0): Executed 741 of 773 (1 FAILED) (0 secs / 10.024 secs)
HeadlessChrome 0.0.0 (Linux 0.0.0): Executed 742 of 773 (1 FAILED) (0 secs / 10.026 secs)
HeadlessChrome 0.0.0 (Linux 0.0.0): Executed 743 of 773 (1 FAILED) (0 secs / 10.029 secs)
HeadlessChrome 0.0.0 (Linux 0.0.0): Executed 744 of 773 (1 FAILED) (0 secs / 10.03 secs)
HeadlessChrome 0.0.0 (Linux 0.0.0): Executed 745 of 773 (1 FAILED) (0 secs / 10.032 secs)
HeadlessChrome 0.0.0 (Linux 0.0.0): Executed 746 of 773 (1 FAILED) (0 secs / 10.038 secs)
HeadlessChrome 0.0.0 (Linux 0.0.0): Executed 747 of 773 (1 FAILED) (0 secs / 10.048 secs)
HeadlessChrome 0.0.0 (Linux 0.0.0): Executed 748 of 773 (1 FAILED) (0 secs / 10.049 secs)
HeadlessChrome 0.0.0 (Linux 0.0.0): Executed 749 of 773 (1 FAILED) (0 secs / 10.053 secs)
HeadlessChrome 0.0.0 (Linux 0.0.0): Executed 750 of 773 (1 FAILED) (0 secs / 10.055 secs)
HeadlessChrome 0.0.0 (Linux 0.0.0): Executed 751 of 773 (1 FAILED) (0 secs / 10.056 secs)
HeadlessChrome 0.0.0 (Linux 0.0.0): Executed 752 of 773 (1 FAILED) (0 secs / 10.057 secs)
HeadlessChrome 0.0.0 (Linux 0.0.0): Executed 753 of 773 (1 FAILED) (0 secs / 10.059 secs)
HeadlessChrome 0.0.0 (Linux 0.0.0): Executed 754 of 773 (1 FAILED) (0 secs / 10.06 secs)
HeadlessChrome 0.0.0 (Linux 0.0.0): Executed 755 of 773 (1 FAILED) (0 secs / 10.063 secs)
HeadlessChrome 0.0.0 (Linux 0.0.0): Executed 756 of 773 (1 FAILED) (0 secs / 10.065 secs)
HeadlessChrome 0.0.0 (Linux 0.0.0): Executed 757 of 773 (1 FAILED) (0 secs / 10.067 secs)
HeadlessChrome 0.0.0 (Linux 0.0.0): Executed 758 of 773 (1 FAILED) (0 secs / 10.068 secs)
HeadlessChrome 0.0.0 (Linux 0.0.0): Executed 759 of 773 (1 FAILED) (0 secs / 10.07 secs)
HeadlessChrome 0.0.0 (Linux 0.0.0): Executed 760 of 773 (1 FAILED) (0 secs / 10.071 secs)
HeadlessChrome 0.0.0 (Linux 0.0.0): Executed 761 of 773 (1 FAILED) (0 secs / 10.072 secs)
HeadlessChrome 0.0.0 (Linux 0.0.0): Executed 762 of 773 (1 FAILED) (0 secs / 10.073 secs)
HeadlessChrome 0.0.0 (Linux 0.0.0): Executed 763 of 773 (1 FAILED) (0 secs / 10.075 secs)
HeadlessChrome 0.0.0 (Linux 0.0.0): Executed 764 of 773 (1 FAILED) (0 secs / 10.081 secs)
HeadlessChrome 0.0.0 (Linux 0.0.0): Executed 765 of 773 (1 FAILED) (0 secs / 10.084 secs)
HeadlessChrome 0.0.0 (Linux 0.0.0): Executed 766 of 773 (1 FAILED) (0 secs / 10.086 secs)
HeadlessChrome 0.0.0 (Linux 0.0.0): Executed 767 of 773 (1 FAILED) (0 secs / 10.087 secs)
HeadlessChrome 0.0.0 (Linux 0.0.0): Executed 768 of 773 (1 FAILED) (0 secs / 10.088 secs)
HeadlessChrome 0.0.0 (Linux 0.0.0): Executed 769 of 773 (1 FAILED) (0 secs / 10.09 secs)
HeadlessChrome 0.0.0 (Linux 0.0.0): Executed 770 of 773 (1 FAILED) (0 secs / 10.091 secs)
HeadlessChrome 0.0.0 (Linux 0.0.0): Executed 771 of 773 (1 FAILED) (0 secs / 10.094 secs)
HeadlessChrome 0.0.0 (Linux 0.0.0): Executed 772 of 773 (1 FAILED) (0 secs / 10.098 secs)
HeadlessChrome 0.0.0 (Linux 0.0.0): Executed 773 of 773 (1 FAILED) (0 secs / 10.099 secs)
HeadlessChrome 0.0.0 (Linux 0.0.0): Executed 773 of 773 (1 FAILED) (10.418 secs / 10.099 secs)
ERROR: Error detected when running the Jasmine tests.
ERROR: Error detected when running the Jasmine tests.
Build step 'Execute shell' marked build as failure
Not sending mail to unregistered user akshay.joshi@enterprisedb.com


Jenkins build is back to normal : pgadmin4-master-python37 #148

От
pgAdmin 4 Jenkins
Дата: